{"text_format":"1","workbook":"xlsx","n_sheets":15,"sheets":["Program Info","Application","Incentive Calculator","Estimate","Estimate QC","Project Summary Form","Payment 1 QC","Payment 2 QC","Payment Request Form","TuneUpsBuildings052317-2016EUI","Change Log, Version ID","PNNL Est. Savings %","Portfolio Stats","DataLabel Definitions","DropDown Lookups"],"not_rendered":{"charts":0,"images":10,"macros":1,"external_links":9,"defined_names":105,"comments":3,"pivot_tables":0},"unopened":[],"bounds":{"document_bytes":16777216,"sheet_cells":100000,"rows_first":2000,"rows_last":500,"rows_between":2000,"halvings":0,"cell_chars":16384,"cell_head_chars":4096},"cells_cut":0,"cells_raw":0,"read":"whole","date_system":"1900"}

{"sheet":"Program Info","index":0,"n_rows":49,"n_cols":13,"rows_kept":49,"cut":false,"hidden":false,"merged":[]}
[null,"Seattle Office Of Sustainability & Environment ",null,null,null,null,null,null,null,"Revised: ",{"$f":"Application!N2","v":"2018-01-18"},null,{"$f":"Application!P2","v":"Version 1.0.2"}]
[null,null,null,null,null,null,"Building Tune-Up Accelerator"]
[]
[]
[]
[]
[]
[]
{"$rows_left_out":42}
{"sheet":"Application","index":1,"n_rows":73,"n_cols":256,"rows_kept":73,"cut":false,"hidden":false,"merged":[[2,4,2,8],[2,9,2,10],[2,11,2,12],[2,14,2,15],[3,9,3,10],[3,12,3,13],[3,14,3,15],[7,3,8,8],[7,9,7,15],[9,3,9,15],[10,4,10,8],[10,9,13,10],[10,11,11,15],[11,4,11,8],[12,4,12,5],[12,6,12,7],[12,11,13,15],[13,4,13,8],[4,9,4,10],[4,11,4,15],[5,9,5,10],[5,11,5,15],[6,9,6,10],[6,11,6,13],[16,4,16,15],[14,3,14,15],[15,4,15,11],[15,13,15,15],[17,4,17,8],[17,10,17,11],[20,4,20,8],[20,9,20,10],[20,11,20,15],[18,4,18,8],[18,9,18,10],[18,11,18,15],[19,4,19,8],[19,9,19,10],[19,11,19,15],[21,4,21,8],[21,9,21,10],[21,11,21,15],[71,3,71,15],[23,3,23,15],[24,4,24,15],[25,4,25,8],[25,10,25,11],[26,4,26,8],[26,9,26,10],[26,11,26,15],[27,4,27,8],[27,9,27,10],[27,11,27,15],[30,3,50,15],[53,3,69,15]]}
[]
[null,null,null,null,null,null,null,null,null,null,null,null,"Revised: ",{"$f":"'Change Log, Version ID'!D6","v":"2018-01-18"},null,{"$f":"'Change Log, Version ID'!G2","v":"Version 1.0.2"},null," "]
[null,null,null,null,"Building Tune-Up Accelerator",null,null,null,null,"EMA:",null,null,null,"Supv:"]
[null,null,null,null,null,null,null,null,null,"Proj. #:",null,null,"Date Assigned:"]
[null,null,null,"Customer Energy Solutions - Business Conservation Program",null,null,null,null,null,"Project Name: "]
[null,null,null,"Program Application for Building Tune-Up Accelerator",null,null,null,null,null,"City of Seattle Building ID:"]
[null,null,null,null,null,null,null,null,null,"Facility Use: ",null,null,null,null,"Use Code: ",{"$f":"IF(L7=\"\",\"\",VLOOKUP(L7,'DropDown Lookups'!$A$11:$B$50,2,FALSE))","v":""}]
[null,null,null,"Please enter information into the green cells & send to accelerator@seattle.gov \nQuestions? Call 206-233-7184.",null,null,null,null,null,"For Internal Use Only"]
{"$rows_left_out":66}
{"sheet":"Incentive Calculator","index":2,"n_rows":108,"n_cols":14,"rows_kept":108,"cut":false,"hidden":true,"merged":[[2,5,2,9],[6,5,6,7],[7,5,7,7],[59,4,59,5],[31,4,35,7],[51,6,51,7],[52,6,52,7],[27,5,27,6],[12,5,12,6],[101,1,101,3],[102,1,102,3],[93,1,93,3],[94,1,94,3],[95,1,95,3],[96,1,96,3],[97,1,97,3],[82,1,82,3],[81,1,81,3],[98,1,98,3],[99,1,99,3],[100,1,100,3],[88,1,88,3],[89,1,89,3],[90,1,90,3],[91,1,91,3],[92,1,92,3],[84,1,84,3],[85,1,85,3],[86,1,86,3],[87,1,87,3]]}
[]
[]
[null,null,null,null,null,"Accelerator Program Basic Tune-Up Incentive Calculator"]
[]
[]
[null,null,null,null,"SCL Project #",{"$f":"IF(ISBLANK(Application!L4),\"\",Application!L4)","v":""}]
[null,null,null,null,"Facility Name: ",{"$f":"IF(ISBLANK(Application!E11),\"\",Application!E11)","v":""}]
[null,null,null,null,"Address: ",{"$f":"IF(ISBLANK(Application!E12),\"\",Application!E12)","v":""}]
{"$rows_left_out":101}
{"sheet":"Estimate","index":3,"n_rows":38,"n_cols":11,"rows_kept":38,"cut":false,"hidden":true,"merged":[[24,2,24,9],[7,2,7,5],[8,2,8,5],[9,2,9,5],[21,2,21,5],[23,2,23,9],[13,3,13,4],[11,3,11,4],[33,2,33,9],[34,2,34,9],[26,2,26,9],[28,2,28,10],[29,2,29,9],[30,2,30,9],[31,2,31,9],[32,2,32,9]]}
[]
[]
[null,null,null,null,null,null,null,null,"Project Number: ",{"$f":"Application!L4","v":0}]
[null,null,"Customer Energy Solutions - Building Tune-Up Accelerator",null,null,null,null,null,"Seattle Benchmark Program Building ID #",{"$f":"IF(Application!L6=\"\",\"\",Application!L6)","v":""}]
[null,null,"Incentive Estimate",null,null,null,null,null,"Date: "]
[]
[null,null,null,null,null,null,null,null,"Estimated annual cash savings: ",{"$f":"IF(J22=\"\",\"\",J22)","v":{"$error":"#VALUE!"}}]
[null,null,{"$f":"IF(Application!L5=\"\",\"\",Application!L5)","v":""},null,null,null,null,null,"Estimated cost after incentives: ",{"$f":"IF(G22=\"\",\"\",(G22-H22))","v":{"$error":"#DIV/0!"}}]
{"$rows_left_out":31}
{"sheet":"Estimate QC","index":4,"n_rows":43,"n_cols":14,"rows_kept":43,"cut":false,"hidden":true,"merged":[[2,11,2,12],[3,11,3,12],[7,2,7,3],[7,4,7,12],[8,2,8,3],[8,4,8,12],[17,11,17,12],[9,2,9,3],[9,4,9,12],[11,6,11,8],[11,10,11,12],[12,6,12,7],[12,10,12,12],[13,6,13,7],[13,11,13,12],[14,11,14,12],[15,10,15,12],[16,11,16,12],[20,10,20,12],[25,11,25,12],[30,5,30,6],[34,5,34,7],[34,8,34,9],[40,3,40,6],[40,7,40,11],[41,3,41,6],[41,7,41,11],[35,5,35,7],[35,8,35,9],[36,5,36,7],[36,8,36,9],[39,3,39,6],[39,7,39,11]]}
[]
[]
[null,null,null,null,null,null,null,null,null,null,null,"Project Number: "]
[null,null,null,null,null,null,null,null,null,null,null,{"$f":"IF(Application!$L$4=\"\",\"\",Application!$L$4)","v":""}]
[null,null,"  Customer Energy Solutions - Business Conservation Program"]
[null,null,"  Tune-Up Accelerator Incentive Estimate QC Checklist"]
[]
[null,null,"Facility Name:",null,{"$f":"IF(Application!$E$11=\"\",\"\",Application!$E$11)","v":""}]
{"$rows_left_out":36}
{"sheet":"Project Summary Form","index":5,"n_rows":102,"n_cols":56,"rows_kept":102,"cut":false,"hidden":true,"merged":[[17,9,17,13],[14,6,14,7],[14,8,14,13],[15,2,15,5],[15,9,15,13],[16,9,16,13],[54,8,54,12],[55,1,55,4],[55,8,55,12],[56,2,56,3],[98,1,98,16]]}
[null,"See notes below the table for information about specific columns.  Do not print the grey areas.  Do not delete or add Rows or Columns.",null,null,null,null,null,null,null,null,null,null,null,null,null,null,null,null,null,"DO NOT DELETE",null,null,null,null,null,null,null,"DO NOT DELETE","HIDE DO NOT DELETE THESE COLUMNS",null,null,null,null,null,"HIDE DO NOT DELETE THESE COLUMNS",null,null,null,null,null,"HIDE DO NOT DELETE",null,null,"HIDE","HIDE","HIDE","HIDE DO NOT DELETE THESE COLUMNS",null,null,"HIDE","HIDE","HIDE","HIDE","HIDE","HIDE","HIDE"]
[null,null,null,null,null,null,null,null,null,null,null,null,"Project #:",{"$f":"IF(ISBLANK(Application!L4),\"\",Application!L4)","v":""},null,null,null,null,null,"GREY COLUMNS",null,null,null,null,null,null,null,"GREY COLUMNS",null,null,null,null,null,null,null,null,null,null,null,null,null,null,null,null,null,null,"FUNDING CAP CALCULATIONS"]
[null,"Customer Energy Solutions - Business Conservation Program",null,null,null,null,null,null,null,null,null,null,null,null,null,"Average Cost of Electricity Assumed in Calculations, $/kWh: ",{"$f":"IF('Incentive Calculator'!H41=\"\",\"\",'Incentive Calculator'!H41)","v":0.08},null,null,null,null,null,null,null,null,null,null,null,"THESE COLUMNS ARE NORMALLY BE HIDDEN",null,null,null,null,null,null,null,null,null,null,null,null,null,null,null,null,null,"The funding cap ratios are calculated at the BOTTOM OF THE FIXTURE COUNT WORKSHEET."]
[null,"Project Summary Form",null,null,null,null,null,null,null,null,null,null,null,null,null,"Out of pocket cost to customer:",{"$f":"J22-M22","v":0},null,null,null,null,"LEVELIZED COST CALCULATION",null,null,null,null,null,null,"DO NOT ERASE ANY OF THE CONTENTS, OR DELETE ANY OF THE GREY COLUMNS.",null,null,null,null,null,null,null,null,null,null,null,null,null,null,null,null,null,"They are applied line by line in equations in the Project Summary Form (as well as on the Fixture Count Worksheet.)"]
[null,"This form is autopulated.",null,null,null,null,null,null,"Total Resource Levelized Cost in $/kWh: ",{"$f":"+X7","v":0},null,null,null,null,null,"ROI:",{"$f":"IF(Q6=\"\",\"\",1/Q6)","v":{"$error":"#VALUE!"}}]
[null,null,null,null,null,null,null,null,"Utility Levelized Cost in $/kWh: ",{"$f":"+X6","v":0},null,null,null,null,null,"Simple payback (yrs):",{"$f":"IF(Q47*Q3=0,\"\",+Q4/(Q47*Q3))","v":{"$error":"#VALUE!"}},null,null,null,null,null,"Levelized Utility Cost, $/kWh:",{"$f":"IF(W47=0,0,+P47/(W47))","v":0},"for project as whole",null,null,null,null,"CONDITIONAL MESSAGES"]
[null,null,null,"Facility Name:  ",{"$f":"IF(ISBLANK(Application!E11),\"\",Application!E11)","v":""},null,null,null,null,null,null,null,null,null,null,"Incentive as a % of Total Cost:",{"$f":"P47/total_cost_on_proj_sum","v":{"$error":"#DIV/0!"}},null,null,null,null,null,"Levelized Total Resource Cost, $/kWh:",{"$f":"IF(W47=0,0,+total_cost_on_proj_sum/W47)","v":0},"for project as whole",null,null,null,null,"Cell G11 has a formula that produces messages in the case of cap conditions."]
[null,null,null,"Address:  ",{"$f":"IF(ISBLANK(Application!E12),\"\",Application!E12)","v":""},null,null,null,null,null,null,null,null,null,null,"Estimated annual cash savings:",{"$f":"+Q3*savings_from_proj_sum_form","v":{"$error":"#VALUE!"}},null,null,null,null,null,null,null,null,null,null,null,null,null,"It's reproduced here in case it gets inadvertently deleted from G11:",null,null,null,null,null,null,null,null,null,null,null,null,null,null,null,"Cost-based Funding Cap Ratio:",{"$f":"+Cost_Based_Funding_Cap_Ratio","v":0},"This ratio is multiplied times the uncapped funding."]
{"$rows_left_out":95}
{"sheet":"Payment 1 QC","index":6,"n_rows":41,"n_cols":18,"rows_kept":41,"cut":false,"hidden":true,"merged":[[12,6,12,7],[12,10,12,12],[2,11,2,12],[3,11,3,12],[7,2,7,3],[7,4,7,12],[8,2,8,3],[8,4,8,12],[9,2,9,3],[9,4,9,12],[10,8,10,10],[11,6,11,8],[11,10,11,12],[23,11,23,12],[13,6,13,7],[13,11,13,12],[14,11,14,12],[15,10,15,12],[16,11,16,12],[17,11,17,12],[18,10,18,12],[19,11,19,12],[20,11,20,12],[21,11,21,12],[22,11,22,12],[36,2,36,3],[37,2,39,12],[24,11,24,12],[32,3,32,6],[32,7,32,11],[33,3,33,6],[33,7,33,11],[34,3,34,6],[34,7,34,11]]}
[]
[]
[null,null,null,null,null,null,null,null,null,null,null,"Project Number:"]
[null,null,null,null,null,null,null,null,null,null,null,{"$f":"IF(Application!$L$4=\"\",\"\",Application!$L$4)","v":""}]
[null,null,"Customer Energy Solutions - Business Conservation Program"]
[null,null,"Tune-Up Accelerator Incentive Payment 1 (Assessment) QC Checklist"]
[]
[null,null,"Facility Name:",null,{"$f":"IF(Application!$E$11=\"\",\"\",Application!$E$11)","v":""}]
{"$rows_left_out":34}
{"sheet":"Payment 2 QC","index":7,"n_rows":41,"n_cols":18,"rows_kept":41,"cut":false,"hidden":true,"merged":[[36,2,36,3],[37,2,39,12],[24,11,24,12],[32,3,32,6],[32,7,32,11],[33,3,33,6],[33,7,33,11],[34,3,34,6],[34,7,34,11],[25,11,25,12],[23,11,23,12],[13,6,13,7],[13,11,13,12],[14,11,14,12],[15,10,15,12],[16,11,16,12],[17,11,17,12],[18,10,18,12],[19,11,19,12],[20,11,20,12],[21,11,21,12],[22,11,22,12],[12,6,12,7],[12,10,12,12],[2,11,2,12],[3,11,3,12],[7,2,7,3],[7,4,7,12],[8,2,8,3],[8,4,8,12],[9,2,9,3],[9,4,9,12],[10,8,10,10],[11,6,11,8],[11,10,11,12]]}
[]
[]
[null,null,null,null,null,null,null,null,null,null,null,"Project Number:"]
[null,null,null,null,null,null,null,null,null,null,null,{"$f":"IF(Application!$L$4=\"\",\"\",Application!$L$4)","v":""}]
[null,null,"Customer Energy Solutions - Business Conservation Program"]
[null,null,"Tune-Up Accelerator Incentive Payment 2 (\"Completed Actions\") QC Checklist"]
[]
[null,null,"Facility Name:",null,{"$f":"IF(Application!$E$11=\"\",\"\",Application!$E$11)","v":""}]
{"$rows_left_out":34}
{"sheet":"Payment Request Form","index":8,"n_rows":62,"n_cols":9,"rows_kept":62,"cut":false,"hidden":true,"merged":[[54,5,54,8],[55,5,55,8],[56,5,56,8],[57,5,57,8],[55,1,55,2],[51,2,51,4],[53,5,53,8],[12,1,12,7],[5,1,5,4],[6,1,6,4],[7,1,7,4],[8,1,8,4],[43,1,45,8],[41,1,42,8]]}
[]
[]
[null,"Customer Energy Solutions - Business Conservation Program",null,null,null,null,null,"Project Number: ",{"$f":"IF(Application!L4=\"\",\"\",Application!L4)","v":""}]
[null,"Conservation Incentive Payment Request",null,null,null,null,null,"Date: "]
[null,null,null,null,null,null,null,"Estimated annual cash savings: ",{"$f":"'Project Summary Form'!Q8","v":{"$error":"#VALUE!"}}]
[null,{"$f":"IF(Application!L5=\"\",\"\",Application!L5)","v":""},null,null,null,null,null,"Estimated cost after incentives: ",{"$f":"'Project Summary Form'!Q4","v":0}]
[null,{"$f":"IF(Application!E11=\"\",\"\",Application!E11)","v":""},null,null,null,null,null,"Estimated Seattle City Light Incentive: ",{"$f":"'Project Summary Form'!P47","v":{"$error":"#DIV/0!"}}]
[null,{"$f":"IF(Application!E12=\"\",\"\",Application!E12)","v":""},null,null,null,null,null,"Estimated Incentive as a Percent of Cost: ",{"$f":"'Project Summary Form'!Q7","v":{"$error":"#DIV/0!"}}]
{"$rows_left_out":55}
{"sheet":"TuneUpsBuildings052317-2016EUI","index":9,"n_rows":1566,"n_cols":32,"rows_kept":1566,"cut":false,"hidden":true,"merged":[]}
["BuildingId","BuildingTypeName","KCPinNumber","TuneUpTypeName","EPABuildingTypeName","BuildingName","BUILDING_NAME","FullAddress","ElectricGridRenewNonNormQuantity","EPA Reported GFA","OSE_GFANoParking","kWh/ SqFt","SiteEUINonNormQuantity","EUIRankDescription","ScoreNumber","VirtualAuditSCLCustomer","SCLCustomerAddress","OSE_NonResidentialTotal","OSE_GFANoParking","IsCompliantFlag","EnergyStarYearsDescription","SourceEUINonNormQuantity","SiteTotalNonNormQuantity","kBtu/ SqFt","GasTotalNonNormQuantity","SteamTotalNonNormQuantity","LargestPropertyUseType","LargestPropertyUseTypeGFA","SecondLargestPropertyUseType","SecondLargestPropertyUseTypeGFA","ThirdLargestPropertyUseType","ThirdLargestPropertyUseTypeGFA"]
[1,"NonResidential","0659000030","TU2020","Hotel","MAYFLOWER PARK HOTEL","Mayflower park hotel","405 OLIVE WAY, SEATTLE, WA 98101",1156514,88434,88434,{"$f":"I2/J2","v":13.077707668996087},81.699996948242202,"Medium High",60,"MAYFLOWER PK HOTEL WESTLAKE PK ASSOC","405 OLIVE WAY",88434,88434,"Y","",182.5,7226362.5,{"$f":"W2/J2","v":81.714753375398601},12764.529296875,2003882,"Hotel",88434,"",null,""]
[2,"NonResidential","0659000220","TU2020","Hotel","PARAMOUNT HOTEL","Paramount Hotel","724 PINE ST, SEATTLE, WA 98101",950425.375,88502,88502,10.739027084133692,94.800003051757798,"Medium High",61,"HOTEL","724 PINE ST",88502,88502,"Y","",176.10000610351599,8387933,94.776762107071022,51450.81640625,null,"Hotel",83880,"Parking",15064,"Restaurant",4622]
[3,"NonResidential","0659000475","TU2018","Hotel","WESTIN HOTEL","5673-The Westin Seattle","1900 5TH AVE, SEATTLE, WA 98101",14515440,756493,null,19.187804778101054,96,"Medium High",43,"","",759389,null,"Y","",241.89999389648401,72587024,95.952010130959579,14938,21566554,"Hotel",756493,"",null,""]
[5,"NonResidential","0659000640","TU2021","Hotel","HOTEL MAX","HOTEL MAX","620 STEWART ST, SEATTLE, WA 98101",811525.375,61320,61320,13.234268998695368,null,"",null,"VANCE HOTEL","620 STEWART ST",61320,61320,"N","",null,null,0,18112.130859375,null,"Hotel",61320,"",null,""]
[8,"NonResidential","0659000970","TU2019","Hotel","WARWICK SEATTLE HOTEL","WARWICK SEATTLE HOTEL (ID8)","401 LENORA ST, SEATTLE, WA 98121",1573449,123445,107430,12.746154157722062,114.800003051758,"Highest Use",75,"WARWICK CORP","401 LENORA ST",113580,107430,"Y","",211.39999389648401,14172606,114.80907286645875,88039.984375,null,"Hotel",123445,"Parking",68009,"Swimming Pool",0]
[9,"Nonresidential COS","0660000560","TU2021","Other","WEST PRECINCT (SEATTLE POLICE)","West Precinct","810 VIRGINIA ST, SEATTLE, WA 98101",2160444,88830,60090,24.321107733873692,136.10000610351599,"Highest Use",null,"","",56298,60090,"Y","",316.29998779296898,12086616,136.0645727794664,47151.81640625,null,"Police Station",88830,"",null,""]
[10,"NonResidential","0660000825","TU2020","Hotel","CAMLIN WORLDMARK HOTEL","Camlin","1619 9TH AVE, SEATTLE, WA 98101",823920,81352,83008,10.127839512243092,70.800003051757798,"Medium Low",27,"TREND WEST RESORTS","1619 9TH AVE",83008,83008,"Y","",146.60000610351599,5758795,70.788609991149571,29475.80078125,null,"Hotel",81352,"",null,""]
{"$rows_left_out":1559}
{"sheet":"Change Log, Version ID","index":10,"n_rows":21,"n_cols":7,"rows_kept":21,"cut":false,"hidden":true,"merged":[[9,3,9,5],[10,3,10,5],[11,3,11,5],[12,3,12,5],[14,3,14,5]]}
[]
[null,null,null,null,null,null,{"$f":"CONCATENATE(\"Version \",VersionID)","v":"Version 1.0.2"}]
[null,null,"Change Log and Version ID",null,"Program:","Tune-Up Accelerator"]
[]
[null,null,"Current version:",{"$f":"IF(C18=\"\",\"\",VLOOKUP(D6,C18:D200,2,FALSE))","v":"1.0.2"}]
[null,null,"Date of change",{"$f":"IF(C18=\"\",\"\",MAX(C18:C200))","v":"2018-01-18"}]
[]
[null,null,"Version format:","x.y.z"]
{"$rows_left_out":14}
{"sheet":"PNNL Est. Savings %","index":11,"n_rows":49,"n_cols":11,"rows_kept":49,"cut":false,"hidden":true,"merged":[]}
["Table A.2. Packages: Electricity Savings as a Percent of Total Electricity Consumption"]
[null,"Large Hotel","Large Office, College University, Hospital (Administrative)","Medium Office, Outpatient Healthcare","Small Office","Primary School","Secondary School","StandAlone Retail, Retail Dealership","Stripmall Retail","Supermarket, other Food Sales"]
["Savings (Inefficient)",0.156,0.13800000000000001,0.34200000000000003,0.26300000000000001,0.16500000000000001,0.152,0.17399999999999999,9.2999999999999999E-2,5.2999999999999999E-2]
["Savings (Typical)",0.13400000000000001,6.9000000000000006E-2,0.18099999999999999,0.18099999999999999,0.126,0.14199999999999999,0.14799999999999999,9.0999999999999998E-2,5.2999999999999999E-2]
["Savings (Efficient)",0.14399999999999999,4.2999999999999997E-2,8.2000000000000003E-2,7.2999999999999995E-2,1.2999999999999999E-2,2.5000000000000001E-2,0,0,0]
["Savings (Percent, Overall)",0.14099999999999999,7.5999999999999998E-2,0.19500000000000001,0.17,0.104,0.112,0.114,6.6000000000000003E-2,3.7999999999999999E-2]
["Energy Savings and Peak Load Reduction Benefits from Building Controls Measures in Seattle, Washington; May, 2017"]
["Pacific Northwest National Laboratory"]
{"$rows_left_out":42}
{"sheet":"Portfolio Stats","index":12,"n_rows":50,"n_cols":23,"rows_kept":50,"cut":false,"hidden":true,"merged":[]}
[]
[null,"City of Seattle Building Benchmark Data-- Year Ending 2016"]
[]
[null,null,null,null,null,"Based on Total Reported EUI",null,null,null,"kWh / SqFt",null,null,null,null,"% of Buildings in each class",null,null,null,null,"kBtu/ SqFt"]
[null,null,"Count","Gross Floor Area (sf)",null,"Efficient (Low Quartile)","Typical (Middle Quartiles)","Inefficient (High Quartile)",null,"MIN","MAX","Average","Median",null,"Lowest Use","Medium Low","Medium High","Highest Use",null,"Lowest Use","Medium Low","Medium High","Highest Use"]
[null,"College/University",20,4944040,null,0.3,0.65,0.05,null,1.7785243055555555,17.360896782646673,10.531128979194971,10.703917781472084,null,0.3,0.3,0.35,0.05,null,23.48333311080933,59.166666030883789,91.0142865862165,144.5]
[null,"Distribution Center",51,3333772,null,0.36170212765957449,0.40425531914893614,0.23404255319148937,null,0.62147655818396663,63.136210324329134,6.99541604830348,5.2111644190871367,null,0.36170212765957449,0.14893617021276595,0.25531914893617019,0.23404255319148937,null,24.228571210588711,24.228571210588711,33.799999823937043,68.300001144409251]
[null,"Hospital",9,6591775,null,0.2,0.5,0.3,null,5.4428457020213985,38.46803185437998,26.081329826546579,26.130388512426556,null,0.2,0.3,0.2,0.3,null,191.89999898274732,191.89999898274732,217.10000610351599,263.09999084472651]
{"$rows_left_out":43}
{"sheet":"DataLabel Definitions","index":13,"n_rows":48,"n_cols":7,"rows_kept":48,"cut":false,"hidden":true,"merged":[]}
["Field","Description","Units","Importance for Tune-Ups (Per draft Director's Rule) or Asset Score","Asset Score Preview Field?","AS Field Name"]
["BuildingId","COS custom ID using for energy benchmarking reporting."]
["KCPinNumber","King County tax parcel number"]
["EPA_BUILDING_ID","Portfolio Manager building ID #. Also referred to as EPABuildingId."]
["BuildingTypeName","COS ID used for sorting buildings into high level types.",null,"Part of TuneUp Eligible Iff function."]
["BuildingName","Name listed in King County or updated though customer contact.",null,null,"X","building_name"]
["Address","Address listed in King County or updated though customer contact.",null,null,"X","street"]
["City","City listed in King County or updated though customer contact.",null,null,"X","city","state will be all WA"]
{"$rows_left_out":41}
{"sheet":"DropDown Lookups","index":14,"n_rows":69,"n_cols":7,"rows_kept":69,"cut":false,"hidden":true,"merged":[]}
[null,"Basic Tune-Up:\n","Tune-Up Plus:\n","Building Renewal Program:\n"]
[null,"This basic Tune-Up meets BTU Requirements. No other additional scope.","Tune-Up meets BTU Requirements & Additional standard conservation measures requested, e.g. Lighting or HVAC","Tune-Up meets BTU Requirements & Integrated Design Lab support requested for \"Deep Retrofits\". "]
[null,"Contractor"]
[null,"Customer"]
[]
[]
[]
[]
{"$rows_left_out":61}